>>> warp: Building community/warp 1.0.0-r1 (using abuild 3.18.0_rc7-r1) started Thu, 15 Oct 2026 00:17:04 +0000
>>> warp: Validating /home/buildozer/aports/community/warp/APKBUILD...
>>> warp: Analyzing dependencies...
>>> warp: Installing for build: build-base cargo desktop-file-utils gst-plugins-bad-dev gtk4.0-dev itstool libadwaita-dev meson
( 1/284) Installing libffi (3.8.0-r0)
( 2/284) Installing xz-libs (5.8.4-r0)
( 3/284) Installing libxml2 (2.13.9-r2)
( 4/284) Installing llvm23-libs (23.1.3-r0)
( 5/284) Installing scudo-malloc (23.1.3-r0)
( 6/284) Installing rust (1.99.0-r2)
( 7/284) Installing sqlite-libs (3.54.0-r0)
( 8/284) Installing libssh2 (1.11.1-r3)
( 9/284) Installing cargo (1.99.0-r2)
( 10/284) Installing libintl (1.0-r0)
( 11/284) Installing libeconf (0.8.4-r0)
( 12/284) Installing libblkid (2.42.4-r3)
( 13/284) Installing libmount (2.42.4-r3)
( 14/284) Installing glib (2.90.0-r0)
( 15/284) Installing desktop-file-utils (0.28-r0)
( 16/284) Installing openexr-libiex (3.4.15-r0)
( 17/284) Installing imath (3.2.2-r1)
( 18/284) Installing openexr-libilmthread (3.4.15-r0)
( 19/284) Installing libdeflate (1.26-r0)
( 20/284) Installing openexr-libopenexrcore (3.4.15-r0)
( 21/284) Installing openexr-libopenexr (3.4.15-r0)
( 22/284) Installing soundtouch (2.4.1-r0)
( 23/284) Installing libSvtAv1Enc (4.2.0-r0)
( 24/284) Installing libxau (1.0.12-r0)
( 25/284) Installing libmd (1.3.0-r0)
( 26/284) Installing libbsd (0.12.2-r0)
( 27/284) Installing libxdmcp (1.1.5-r1)
( 28/284) Installing libxcb (1.17.0-r2)
( 29/284) Installing libx11 (1.8.13-r0)
( 30/284) Installing aom-libs (3.15.2-r0)
( 31/284) Installing libbz2 (1.0.8-r6)
( 32/284) Installing libpng (1.6.59-r0)
( 33/284) Installing freetype (2.14.3-r0)
( 34/284) Installing fontconfig (2.18.1-r0)
( 35/284) Installing fribidi (1.0.16-r3)
( 36/284) Installing graphite2 (1.3.15-r0)
( 37/284) Installing harfbuzz (14.2.1-r0)
( 38/284) Installing libunibreak (6.1-r0)
( 39/284) Installing libass (0.17.5-r0)
( 40/284) Installing libxext (1.3.7-r0)
( 41/284) Installing libxrender (0.9.12-r0)
( 42/284) Installing pixman (0.46.4-r0)
( 43/284) Installing cairo (1.18.4-r1)
( 44/284) Installing libraw1394 (2.1.2-r5)
( 45/284) Installing libusb (1.0.30-r0)
( 46/284) Installing libdc1394 (2.2.7-r0)
( 47/284) Installing libde265 (1.1.2-r0)
( 48/284) Installing tslib (1.24-r0)
( 49/284) Installing directfb (1.7.7-r8)
( 50/284) Installing hwdata-pci (0.412-r0)
( 51/284) Installing libpciaccess (0.19-r0)
( 52/284) Installing libdrm (2.4.134-r0)
( 53/284) Installing libdvdcss (1.4.3-r0)
( 54/284) Installing libdvdread (6.1.3-r2)
( 55/284) Installing libdvdnav (6.1.1-r1)
( 56/284) Installing faac (1.31.1-r0)
( 57/284) Installing faad2-libs (2.11.2-r0)
( 58/284) Installing fdk-aac (2.0.2-r4)
( 59/284) Installing alsa-lib (1.2.16.1-r0)
( 60/284) Installing flite (2.2-r7)
( 61/284) Installing libfreeaptx (0.2.2-r0)
( 62/284) Installing gobject-introspection (1.86.0-r2)
( 63/284) Installing shared-mime-info (2.4-r7)
( 64/284) Installing libxcomposite (0.4.7-r0)
( 65/284) Installing libxfixes (6.0.2-r0)
( 66/284) Installing libxcursor (1.2.3-r0)
( 67/284) Installing libxdamage (1.1.7-r0)
( 68/284) Installing libxi (1.8.3-r0)
( 69/284) Installing libxinerama (1.1.6-r0)
( 70/284) Installing libxrandr (1.5.5-r0)
( 71/284) Installing libatk-1.0 (2.62.0-r0)
( 72/284) Installing dbus-libs (1.16.2-r4)
( 73/284) Installing at-spi2-core-libs (2.62.0-r0)
( 74/284) Installing libxtst (1.2.5-r0)
( 75/284) Installing at-spi2-core (2.62.0-r0)
( 76/284) Installing libatk-bridge-2.0 (2.62.0-r0)
( 77/284) Installing cairo-gobject (1.18.4-r1)
( 78/284) Installing avahi-libs (0.9_rc5-r0)
( 79/284) Installing nettle (3.10.2-r0)
( 80/284) Installing libtasn1 (4.21.0-r0)
( 81/284) Installing p11-kit (0.26.2-r1)
( 82/284) Installing gnutls (3.8.13-r0)
( 83/284) Installing cups-libs (2.4.20-r0)
( 84/284) Installing libepoxy (1.5.10-r1)
( 85/284) Installing bubblewrap (0.13.1-r0)
( 86/284) Installing libseccomp (2.6.1-r0)
( 87/284) Installing libglycin (2.2.1-r0)
Executing libglycin-2.2.1-r0.post-install
* glycin loaders got split into their individual subpackages.
* By default, only glycin-image-rs & glycin-svg are installed.
* Additional loader subpackages are glycin-heif, glycin-jxl & glycin-raw.
*
* To install all available loaders, install glycin-loaders-all.
*
* Also the glycin-thumbnailer got subpackaged and isn't installed by default.
( 88/284) Installing glycin-image-rs (2.2.1-r0)
( 89/284) Installing libdav1d (1.5.4-r0)
( 90/284) Installing libxft (2.3.9-r0)
( 91/284) Installing pango (1.58.2-r0)
( 92/284) Installing librsvg (2.62.3-r0)
( 93/284) Installing glycin-svg (2.2.1-r0)
( 94/284) Installing gdk-pixbuf (2.44.8-r0)
( 95/284) Installing wayland-libs-client (1.26.0-r0)
( 96/284) Installing wayland-libs-cursor (1.26.0-r0)
( 97/284) Installing wayland-libs-egl (1.26.0-r0)
( 98/284) Installing xkeyboard-config (2.48-r0)
( 99/284) Installing libxkbcommon (1.13.2-r0)
(100/284) Installing gtk+3.0 (3.24.52-r0)
(101/284) Installing gsm (1.0.24-r0)
(102/284) Installing libelf (0.195-r0)
(103/284) Installing libxshmfence (1.3.3-r0)
(104/284) Installing mesa (26.2.4-r1)
(105/284) Installing mesa-gles (26.2.4-r1)
(106/284) Installing mesa-gbm (26.2.4-r1)
(107/284) Installing mesa-egl (26.2.4-r1)
(108/284) Installing libxxf86vm (1.1.7-r0)
(109/284) Installing mesa-gl (26.2.4-r1)
(110/284) Installing libxv (1.0.13-r0)
(111/284) Installing cdparanoia-libs (10.2-r14)
(112/284) Installing graphene (1.10.8-r5)
(113/284) Installing gstreamer (1.28.7-r0)
(114/284) Installing gstreamer-ptp-helper (1.28.7-r0)
(115/284) Installing libogg (1.3.6-r0)
(116/284) Installing opus (1.6.1-r0)
(117/284) Installing orc (0.4.42-r1)
(118/284) Installing libtheora (1.2.0-r1)
(119/284) Installing libvorbis (1.3.7-r2)
(120/284) Installing gst-plugins-base (1.28.7-r0)
(121/284) Installing eudev-libs (3.2.14-r8)
(122/284) Installing libgudev (238-r1)
(123/284) Installing lcms2 (2.19.1-r0)
(124/284) Installing libmodplug (0.8.9.0-r3)
(125/284) Installing ca-certificates (20260909-r0)
(126/284) Installing neon (0.36.0-r0)
(127/284) Installing sndio-libs (1.10.0-r7)
(128/284) Installing openal-soft-libs (1.25.2-r1)
(129/284) Installing openh264 (2.6.0-r0)
(130/284) Installing openjpeg (2.5.4-r2)
(131/284) Installing librtmp (2.4_git20190330-r5)
(132/284) Installing sbc (2.1-r0)
(133/284) Installing libflac (1.5.0-r0)
(134/284) Installing lame-libs (3.100-r5)
(135/284) Installing mpg123-libs (1.33.7-r0)
(136/284) Installing libsndfile (1.2.2-r3)
(137/284) Installing libjpeg-turbo (3.1.3-r0)
(138/284) Installing libsharpyuv (1.6.0-r0)
(139/284) Installing libwebp (1.6.0-r0)
(140/284) Installing tiff (4.7.2-r0)
(141/284) Installing spandsp (0.0.6-r5)
(142/284) Installing libsrt (1.5.5-r0)
(143/284) Installing libsrtp (2.8.0-r0)
(144/284) Installing libva (2.24.1-r0)
(145/284) Installing vo-aacenc (0.1.3-r3)
(146/284) Installing vo-amrwbenc (0.1.3-r3)
(147/284) Installing vulkan-loader (1.4.360-r0)
(148/284) Installing libwebpmux (1.6.0-r0)
(149/284) Installing numactl (2.0.19-r0)
(150/284) Installing x265-libs (4.2-r0)
(151/284) Installing libxkbcommon-x11 (1.13.2-r0)
(152/284) Installing libzbar (0.23.93-r2)
(153/284) Installing gst-plugins-bad (1.28.7-r0)
(154/284) Installing bzip2-dev (1.0.8-r6)
(155/284) Installing libxml2-utils (2.13.9-r2)
(156/284) Installing docbook-xml (4.5-r10)
Executing docbook-xml-4.5-r10.post-install
(157/284) Installing libxslt (1.1.43-r3)
(158/284) Installing docbook-xsl-ns (1.79.2-r13)
Executing docbook-xsl-ns-1.79.2-r13.post-install
(159/284) Installing docbook-xsl-nons (1.79.2-r13)
Executing docbook-xsl-nons-1.79.2-r13.post-install
(160/284) Installing docbook-xsl (1.79.2-r13)
(161/284) Installing xz (5.8.4-r0)
(162/284) Installing gettext-asprintf (1.0-r0)
(163/284) Installing gettext-libs (1.0-r0)
(164/284) Installing gettext-envsubst (1.0-r0)
(165/284) Installing gettext (1.0-r0)
(166/284) Installing gettext-dev (1.0-r0)
(167/284) Installing mpdecimal (4.0.1-r0)
(168/284) Installing libpanelw (6.6_p20260822-r0)
(169/284) Installing readline (8.3.3-r1)
(170/284) Installing python3 (3.14.8-r0)
(171/284) Installing python3-pycache-pyc0 (3.14.8-r0)
(172/284) Installing pyc (3.14.8-r0)
(173/284) Installing python3-pyc (3.14.8-r0)
(174/284) Installing py3-parsing (3.3.3-r0)
(175/284) Installing py3-parsing-pyc (3.3.3-r0)
(176/284) Installing py3-packaging (26.2-r0)
(177/284) Installing py3-packaging-pyc (26.2-r0)
(178/284) Installing linux-headers (7.2.1-r0)
(179/284) Installing libffi-dev (3.8.0-r0)
(180/284) Installing bsd-compat-headers (0.7.2-r6)
(181/284) Installing libformw (6.6_p20260822-r0)
(182/284) Installing libmenuw (6.6_p20260822-r0)
(183/284) Installing libncurses++ (6.6_p20260822-r0)
(184/284) Installing ncurses-dev (6.6_p20260822-r0)
(185/284) Installing libedit-dev (20260512.3.1-r0)
(186/284) Installing zlib-dev (1.3.2-r1)
(187/284) Installing libpcre2-16 (10.49-r0)
(188/284) Installing libpcre2-32 (10.49-r0)
(189/284) Installing pcre2-dev (10.49-r0)
(190/284) Installing libuuid (2.42.4-r3)
(191/284) Installing libfdisk (2.42.4-r3)
(192/284) Installing skalibs-libs (2.15.1.0-r0)
(193/284) Installing utmps-libs (0.1.3.4-r0)
(194/284) Installing linux-pam (1.7.1-r4)
(195/284) Installing liblastlog2 (2.42.4-r3)
(196/284) Installing libsmartcols (2.42.4-r3)
(197/284) Installing sqlite (3.54.0-r0)
(198/284) Installing sqlite-dev (3.54.0-r0)
(199/284) Installing util-linux-dev (2.42.4-r3)
(200/284) Installing glib-dev (2.90.0-r0)
(201/284) Installing xz-dev (5.8.4-r0)
(202/284) Installing libxml2-dev (2.13.9-r2)
(203/284) Installing gstreamer-dev (1.28.7-r0)
(204/284) Installing libpciaccess-dev (0.19-r0)
(205/284) Installing libdrm-dev (2.4.134-r0)
(206/284) Installing xorgproto (2025.1-r0)
(207/284) Installing libxau-dev (1.0.12-r0)
(208/284) Installing xcb-proto (1.17.0-r1)
(209/284) Installing xcb-proto-pyc (1.17.0-r1)
(210/284) Installing libxdmcp-dev (1.1.5-r1)
(211/284) Installing libxcb-dev (1.17.0-r2)
(212/284) Installing xtrans (1.6.0-r0)
(213/284) Installing libx11-dev (1.8.13-r0)
(214/284) Installing libxfixes-dev (6.0.2-r0)
(215/284) Installing libxdamage-dev (1.1.7-r0)
(216/284) Installing libxshmfence-dev (1.3.3-r0)
(217/284) Installing libxext-dev (1.3.7-r0)
(218/284) Installing libxxf86vm-dev (1.1.7-r0)
(219/284) Installing mesa-dev (26.2.4-r1)
(220/284) Installing orc-compiler (0.4.42-r1)
(221/284) Installing orc-dev (0.4.42-r1)
(222/284) Installing expat (2.9.0-r0)
(223/284) Installing expat-dev (2.9.0-r0)
(224/284) Installing wayland-libs-server (1.26.0-r0)
(225/284) Installing wayland-dev (1.26.0-r0)
(226/284) Installing gst-plugins-base-dev (1.28.7-r0)
(227/284) Installing libva-dev (2.24.1-r0)
(228/284) Installing vulkan-headers (1.4.360-r0)
(229/284) Installing vulkan-loader-dev (1.4.360-r0)
(230/284) Installing libxkbcommon-dev (1.13.2-r0)
(231/284) Installing gst-plugins-bad-dev (1.28.7-r0)
(232/284) Installing dbus-dev (1.16.2-r4)
(233/284) Installing libxi-dev (1.8.3-r0)
(234/284) Installing libxtst-dev (1.2.5-r0)
(235/284) Installing at-spi2-core-dev (2.62.0-r0)
(236/284) Installing brotli (1.2.0-r1)
(237/284) Installing brotli-dev (1.2.0-r1)
(238/284) Installing libpng-dev (1.6.59-r0)
(239/284) Installing freetype-dev (2.14.3-r0)
(240/284) Installing fontconfig-dev (2.18.1-r0)
(241/284) Installing libseccomp-dev (2.6.1-r0)
(242/284) Installing libglycin-dev (2.2.1-r0)
(243/284) Installing gdk-pixbuf-dev (2.44.8-r0)
(244/284) Installing libepoxy-dev (1.5.10-r1)
(245/284) Installing libxinerama-dev (1.1.6-r0)
(246/284) Installing wayland-protocols (1.49-r0)
(247/284) Installing hicolor-icon-theme (0.18-r0)
(248/284) Installing gtk-update-icon-cache (3.24.52-r0)
(249/284) Installing iso-codes (4.20.1-r0)
(250/284) Installing tzdata (2026e-r0)
(251/284) Installing harfbuzz-subset (14.2.1-r0)
(252/284) Installing gtk4.0 (4.24.1-r0)
(253/284) Installing cairo-tools (1.18.4-r1)
(254/284) Installing pixman-dev (0.46.4-r0)
(255/284) Installing libxrender-dev (0.9.12-r0)
(256/284) Installing cairo-dev (1.18.4-r1)
(257/284) Installing graphene-dev (1.10.8-r5)
(258/284) Installing pango-tools (1.58.2-r0)
(259/284) Installing fribidi-dev (1.0.16-r3)
(260/284) Installing harfbuzz-cairo (14.2.1-r0)
(261/284) Installing harfbuzz-gobject (14.2.1-r0)
(262/284) Installing icu-data-en (78.1-r0)
Executing icu-data-en-78.1-r0.post-install
* If you need ICU with non-English locales and legacy charset support, install
* package icu-data-full.
(263/284) Installing icu-libs (78.1-r0)
(264/284) Installing harfbuzz-icu (14.2.1-r0)
(265/284) Installing graphite2-dev (1.3.15-r0)
(266/284) Installing icu (78.1-r0)
(267/284) Installing icu-dev (78.1-r0)
(268/284) Installing harfbuzz-dev (14.2.1-r0)
(269/284) Installing libxft-dev (2.3.9-r0)
(270/284) Installing pango-dev (1.58.2-r0)
(271/284) Installing gtk4.0-dev (4.24.1-r0)
(272/284) Installing py3-libxml2 (2.13.9-r2)
(273/284) Installing py3-libxml2-pyc (2.13.9-r2)
(274/284) Installing itstool (2.0.7-r3)
(275/284) Installing adwaita-fonts-sans (51.0-r0)
(276/284) Installing adwaita-fonts-mono (51.0-r0)
(277/284) Installing adwaita-fonts (51.0-r0)
(278/284) Installing libadwaita (1.10.0-r0)
(279/284) Installing libadwaita-dev (1.10.0-r0)
(280/284) Installing samurai (1.3-r0)
(281/284) Installing meson (1.12.1-r0)
(282/284) Installing meson-pyc (1.12.1-r0)
(283/284) Installing .makedepends-warp (20261015.001708)
(284/284) Installing abuild-meson (1.12.1-r0)
Executing busybox-1.38.0-r7.trigger
Executing glib-2.90.0-r0.trigger
Executing fontconfig-2.18.1-r0.trigger
Executing shared-mime-info-2.4-r7.trigger
Executing gdk-pixbuf-2.44.8-r0.trigger
Executing gtk+3.0-3.24.52-r0.trigger
Executing ca-certificates-20260909-r0.trigger
Executing gtk-update-icon-cache-3.24.52-r0.trigger
OK: 1124.7 MiB in 384 packages
>>> warp: Cleaning up srcdir
>>> warp: Cleaning up pkgdir
>>> warp: Cleaning up tmpdir
>>> warp: Fetching https://distfiles.alpinelinux.org/distfiles/v3.25/warp-v1.0.0.tar.gz
Connecting to distfiles.alpinelinux.org (172.105.82.32:443)
wget: server returned error: HTTP/1.1 404 Not Found
>>> warp: Fetching https://gitlab.gnome.org/World/warp/-/archive/v1.0.0/warp-v1.0.0.tar.gz
Connecting to gitlab.gnome.org (151.101.193.91:443)
saving to '/var/cache/distfiles/v3.25/warp-v1.0.0.tar.gz.part'
warp-v1.0.0.tar.gz.p 100% |********************************| 791k 0:00:00 ETA
'/var/cache/distfiles/v3.25/warp-v1.0.0.tar.gz.part' saved
/var/cache/distfiles/v3.25/warp-v1.0.0.tar.gz: OK
>>> warp: Fetching https://distfiles.alpinelinux.org/distfiles/v3.25/warp-v1.0.0.tar.gz
/var/cache/distfiles/v3.25/warp-v1.0.0.tar.gz: OK
>>> warp: Unpacking /var/cache/distfiles/v3.25/warp-v1.0.0.tar.gz...
The Meson build system
Version: 1.12.1
Source dir: /home/buildozer/aports/community/warp/src/warp-v1.0.0
Build dir: /home/buildozer/aports/community/warp/src/warp-v1.0.0/output
Build type: native build
Program /home/buildozer/aports/community/warp/src/warp-v1.0.0/build-aux/meson-cargo-manifest.py found: YES (/home/buildozer/aports/community/warp/src/warp-v1.0.0/build-aux/meson-cargo-manifest.py)
Program /home/buildozer/aports/community/warp/src/warp-v1.0.0/build-aux/meson-cargo-manifest.py found: YES (/home/buildozer/aports/community/warp/src/warp-v1.0.0/build-aux/meson-cargo-manifest.py)
Program /home/buildozer/aports/community/warp/src/warp-v1.0.0/build-aux/meson-cargo-manifest.py found: YES (/home/buildozer/aports/community/warp/src/warp-v1.0.0/build-aux/meson-cargo-manifest.py)
Project name: warp
Project version: 1.0.0
Rust compiler for the host machine: rustc -C linker=cc (rustc 1.99.0 "1.99.0")
Rust linker for the host machine: ld.bfd 2.45.1
Host machine cpu family: s390x
Host machine cpu: s390x
Program /home/buildozer/aports/community/warp/src/warp-v1.0.0/build-aux/meson-cargo-manifest.py found: YES (/home/buildozer/aports/community/warp/src/warp-v1.0.0/build-aux/meson-cargo-manifest.py)
Program /home/buildozer/aports/community/warp/src/warp-v1.0.0/build-aux/meson-cargo-manifest.py found: YES (/home/buildozer/aports/community/warp/src/warp-v1.0.0/build-aux/meson-cargo-manifest.py)
Program /home/buildozer/aports/community/warp/src/warp-v1.0.0/build-aux/meson-cargo-manifest.py found: YES (/home/buildozer/aports/community/warp/src/warp-v1.0.0/build-aux/meson-cargo-manifest.py)
Program /home/buildozer/aports/community/warp/src/warp-v1.0.0/build-aux/meson-cargo-manifest.py found: YES (/home/buildozer/aports/community/warp/src/warp-v1.0.0/build-aux/meson-cargo-manifest.py)
Found pkg-config: YES (/usr/bin/pkg-config) 3.0.8
Run-time dependency glib-2.0 found: YES 2.90.0
Run-time dependency gio-2.0 found: YES 2.90.0
Run-time dependency gtk4 found: YES 4.24.1
Run-time dependency libadwaita-1 found: YES 1.10.0
Run-time dependency gstreamer-1.0 found: YES 1.28.7
Run-time dependency gstreamer-base-1.0 found: YES 1.28.7
Run-time dependency gstreamer-plugins-base-1.0 found: YES 1.28.7
Run-time dependency gstreamer-plugins-bad-1.0 found: YES 1.28.7
Program glib-compile-schemas found: YES (/usr/bin/glib-compile-schemas)
Program desktop-file-validate found: YES (/usr/bin/desktop-file-validate)
Program appstreamcli found: NO
Program cargo found: YES (/usr/bin/cargo)
Message: Setting up git pre-commit hook
Configuring app.drey.Warp.desktop.in using configuration
Program msgfmt found: YES (/usr/bin/msgfmt)
Configuring app.drey.Warp.metainfo.xml.in using configuration
Configuring app.drey.Warp.service using configuration
Program itstool found: YES (/usr/bin/itstool)
Program msgmerge found: YES (/usr/bin/msgmerge)
Program msgfmt found: YES (/usr/bin/msgfmt)
Program msginit found: YES (/usr/bin/msginit)
Program msgmerge found: YES (/usr/bin/msgmerge)
Program xgettext found: YES (/usr/bin/xgettext)
Message: Building in release mode
Program gtk4-update-icon-cache found: YES (/usr/bin/gtk4-update-icon-cache)
Program update-desktop-database found: YES (/usr/bin/update-desktop-database)
Build targets in project: 88
warp 1.0.0
User defined options
auto_features : auto
b_lto : true
b_pie : true
b_staticpic : true
bindir : /usr/bin
buildtype : plain
datadir : /usr/share
includedir : /usr/include
infodir : /usr/share/info
libdir : /usr/lib
libexecdir : /usr/libexec
localedir : /usr/share/locale
localstatedir : /var
mandir : /usr/share/man
prefix : /usr
python.bytecompile: 0
qr-code-scanning : enabled
sbindir : /usr/sbin
sharedstatedir : /var/lib
sysconfdir : /etc
werror : false
wrap_mode : nodownload
Found ninja-1.9.0 at /usr/bin/ninja
ninja: entering directory '/home/buildozer/aports/community/warp/src/warp-v1.0.0/output'
[1/71] Building translation po/zh_TW/LC_MESSAGES/warp-zh_TW.mo
[2/71] Building translation po/zh_CN/LC_MESSAGES/warp-zh_CN.mo
[3/71] Building translation po/vi/LC_MESSAGES/warp-vi.mo
[4/71] Building translation po/uz/LC_MESSAGES/warp-uz.mo
[5/71] Building translation po/uk/LC_MESSAGES/warp-uk.mo
[6/71] Building translation po/tr/LC_MESSAGES/warp-tr.mo
[7/71] Building translation po/sv/LC_MESSAGES/warp-sv.mo
[8/71] Building translation po/sr/LC_MESSAGES/warp-sr.mo
[9/71] Building translation po/sl/LC_MESSAGES/warp-sl.mo
[10/71] Building translation po/ru/LC_MESSAGES/warp-ru.mo
[11/71] Building translation po/ro/LC_MESSAGES/warp-ro.mo
[12/71] Building translation po/pt_BR/LC_MESSAGES/warp-pt_BR.mo
[13/71] Building translation po/pt/LC_MESSAGES/warp-pt.mo
[14/71] Building translation po/oc/LC_MESSAGES/warp-oc.mo
[15/71] Building translation po/nl/LC_MESSAGES/warp-nl.mo
[16/71] Building translation po/nb/LC_MESSAGES/warp-nb.mo
[17/71] Building translation po/kw/LC_MESSAGES/warp-kw.mo
[18/71] Building translation po/ko/LC_MESSAGES/warp-ko.mo
[19/71] Building translation po/kk/LC_MESSAGES/warp-kk.mo
[20/71] Building translation po/ka/LC_MESSAGES/warp-ka.mo
[21/71] Building translation po/it/LC_MESSAGES/warp-it.mo
[22/71] Building translation po/is/LC_MESSAGES/warp-is.mo
[23/71] Building translation po/ie/LC_MESSAGES/warp-ie.mo
[24/71] Building translation po/id/LC_MESSAGES/warp-id.mo
[25/71] Building translation po/hu/LC_MESSAGES/warp-hu.mo
[26/71] Building translation po/hr/LC_MESSAGES/warp-hr.mo
[27/71] Building translation po/hi/LC_MESSAGES/warp-hi.mo
[28/71] Building translation po/he/LC_MESSAGES/warp-he.mo
[29/71] Building translation po/gl/LC_MESSAGES/warp-gl.mo
[30/71] Building translation po/fur/LC_MESSAGES/warp-fur.mo
[31/71] Building translation po/fr/LC_MESSAGES/warp-fr.mo
[32/71] Building translation po/fi/LC_MESSAGES/warp-fi.mo
[33/71] Building translation po/fa/LC_MESSAGES/warp-fa.mo
[34/71] Building translation po/eu/LC_MESSAGES/warp-eu.mo
[35/71] Building translation po/es/LC_MESSAGES/warp-es.mo
[36/71] Building translation po/eo/LC_MESSAGES/warp-eo.mo
[37/71] Building translation po/en_GB/LC_MESSAGES/warp-en_GB.mo
[38/71] Building translation po/el/LC_MESSAGES/warp-el.mo
[39/71] Building translation po/de/LC_MESSAGES/warp-de.mo
[40/71] Building translation po/da/LC_MESSAGES/warp-da.mo
[41/71] Building translation po/cs/LC_MESSAGES/warp-cs.mo
[42/71] Building translation po/ca/LC_MESSAGES/warp-ca.mo
[43/71] Building translation po/bg/LC_MESSAGES/warp-bg.mo
[44/71] Generating yelp doc help/uk/help-warp-uk-gmo
[45/71] Generating yelp doc help/sv/help-warp-sv-gmo
[46/71] Generating yelp doc help/sl/help-warp-sl-gmo
[47/71] Generating yelp doc help/ru/help-warp-ru-gmo
[48/71] Generating yelp doc help/pt_BR/help-warp-pt_BR-gmo
[49/71] Generating yelp doc help/uk/help-warp-uk
[50/71] Generating yelp doc help/nl/help-warp-nl-gmo
[51/71] Generating yelp doc help/hu/help-warp-hu-gmo
[52/71] Generating yelp doc help/eu/help-warp-eu-gmo
[53/71] Generating yelp doc help/sv/help-warp-sv
[54/71] Generating yelp doc help/sl/help-warp-sl
[55/71] Generating yelp doc help/ru/help-warp-ru
[56/71] Generating yelp doc help/nl/help-warp-nl
[57/71] Generating yelp doc help/hu/help-warp-hu
[58/71] Generating yelp doc help/pt_BR/help-warp-pt_BR
[59/71] Generating yelp doc help/eu/help-warp-eu
[60/71] Generating yelp doc help/es/help-warp-es-gmo
[61/71] Generating yelp doc help/es/help-warp-es
[62/71] Generating yelp doc help/el/help-warp-el-gmo
[63/71] Generating yelp doc help/el/help-warp-el
[64/71] Generating yelp doc help/de/help-warp-de-gmo
[65/71] Generating yelp doc help/de/help-warp-de
[66/71] Generating yelp doc help/bg/help-warp-bg-gmo
[67/71] Merging translations for data/app.drey.Warp.metainfo.xml
[68/71] Generating yelp doc help/bg/help-warp-bg
[69/71] Merging translations for data/app.drey.Warp.desktop
Warning: Could not merge bg translation for msgid:
b'This functionality uses PipeWire, via the same mechanism as GNOME Camera.'
[70/71] Generating data/resources/metainfo.xml with a custom command
[71/71] Generating src/cargo-build with a custom command
Updating crates.io index
Downloading crates ...
Downloaded adler2 v2.0.1
Downloaded aead v0.5.2
Downloaded atomic-waker v1.1.2
Downloaded form_urlencoded v1.2.2
Downloaded arrayvec v0.7.6
Downloaded async-recursion v1.1.1
Downloaded crypto_secretbox v0.1.1
Downloaded digest v0.10.7
Downloaded event-listener-strategy v0.5.4
Downloaded fastrand v2.3.0
Downloaded fnv v1.0.7
Downloaded futures-sink v0.3.32
Downloaded aperture v0.12.0
Downloaded crc-catalog v2.4.0
Downloaded field-offset v0.3.6
Downloaded futures-task v0.3.32
Downloaded byteorder-lite v0.1.0
Downloaded block-buffer v0.10.4
Downloaded darling_macro v0.20.11
Downloaded atomic_refcell v0.1.13
Downloaded crc v3.4.0
Downloaded cfg-if v1.0.4
Downloaded equivalent v1.0.2
Downloaded errno v0.3.14
Downloaded cairo-sys-rs v0.22.0
Downloaded endi v1.1.1
Downloaded crypto-common v0.1.7
Downloaded futures-core v0.3.32
Downloaded bit-set v0.5.3
Downloaded futures-io v0.3.32
Downloaded futures-macro v0.3.32
Downloaded g2gen v1.2.2
Downloaded async-broadcast v0.7.2
Downloaded async-channel v2.5.0
Downloaded async-signal v0.2.13
Downloaded async-process v2.5.0
Downloaded addr2line v0.25.1
Downloaded async-trait v0.1.89
Downloaded env_logger v0.10.2
Downloaded noise-rust-crypto v0.6.2
Downloaded async-net v2.0.0
Downloaded autocfg v1.5.0
Downloaded bit-vec v0.6.3
Downloaded cipher v0.4.4
Downloaded convert_case v0.10.0
Downloaded byteorder v1.5.0
Downloaded deranged v0.5.8
Downloaded displaydoc v0.2.5
Downloaded pango-sys v0.22.0
Downloaded ctr v0.9.2
Downloaded derive_builder_core v0.20.2
Downloaded derive_builder_macro v0.20.2
Downloaded find-msvc-tools v0.1.9
Downloaded data-encoding v2.10.0
Downloaded enumflags2 v0.7.12
Downloaded enumflags2_derive v0.7.12
Downloaded async-executor v1.14.0
Downloaded blocking v1.6.2
Downloaded chacha20 v0.9.1
Downloaded filetime v0.2.27
Downloaded foldhash v0.2.0
Downloaded async-fs v2.2.0
Downloaded async-lock v3.4.2
Downloaded blake2 v0.10.6
Downloaded locale_config v0.3.0
Downloaded allocator-api2 v0.2.21
Downloaded crossbeam-utils v0.8.21
Downloaded event-listener v5.4.1
Downloaded futures-channel v0.3.32
Downloaded darling v0.20.11
Downloaded either v1.15.0
Downloaded fixedbitset v0.5.7
Downloaded rand_chacha v0.3.1
Downloaded async-task v4.7.1
Downloaded bytecodec v0.5.0
Downloaded derive_builder v0.20.2
Downloaded cfg-expr v0.20.7
Downloaded concurrent-queue v2.5.0
Downloaded async-io v2.6.0
Downloaded crc32fast v1.5.0
Downloaded futures-executor v0.3.32
Downloaded bytemuck v1.25.0
Downloaded cairo-rs v0.22.0
Downloaded futures-lite v2.6.1
Downloaded bitflags v2.11.0
Downloaded futures v0.3.32
Downloaded log v0.4.29
Downloaded chacha20poly1305 v0.10.1
Downloaded darling_core v0.20.11
Downloaded simple_moving_average v1.0.2
Downloaded base64 v0.22.1
Downloaded bytes v1.11.1
Downloaded aes v0.8.4
Downloaded aes-gcm v0.10.3
Downloaded async_zip v0.0.18
Downloaded backtrace v0.3.76
Downloaded cc v1.2.58
Downloaded derive_more v2.1.1
Downloaded derive_more-impl v2.1.1
Downloaded fancy-regex v0.13.0
Downloaded flate2 v1.1.9
Downloaded futures-concurrency v7.7.1
Downloaded miniz_oxide v0.8.9
Downloaded pin-project-lite v0.2.17
Downloaded piper v0.2.5
Downloaded pkg-config v0.3.32
Downloaded poly1305 v0.8.0
Downloaded polyval v0.6.2
Downloaded powerfmt v0.2.0
Downloaded aho-corasick v1.1.4
Downloaded chrono v0.4.44
Downloaded num-traits v0.2.19
Downloaded curve25519-dalek v4.1.3
Downloaded strsim v0.11.1
Downloaded potential_utf v0.1.4
Downloaded ordered-stream v0.2.0
Downloaded option-operations v0.6.1
Downloaded yoke v0.8.1
Downloaded zerotrie v0.2.3
Downloaded gdk4-wayland-sys v0.11.0
Downloaded object v0.37.3
Downloaded once_cell v1.21.4
Downloaded opaque-debug v0.3.1
Downloaded zeroize_derive v1.4.3
Downloaded zerovec v0.11.5
Downloaded g2p v1.2.2
Downloaded getrandom v0.4.2
Downloaded itertools v0.13.0
Downloaded trackable_derive v1.0.0
Downloaded itoa v1.0.18
Downloaded gio-sys v0.22.0
Downloaded icu_properties v2.1.2
Downloaded heck v0.5.0
Downloaded pastey v0.2.1
Downloaded subtle v2.6.1
Downloaded proc-macro-crate v3.5.0
Downloaded ident_case v1.0.1
Downloaded if-addrs v0.15.0
Downloaded memoffset v0.9.1
Downloaded urlencoding v2.1.3
Downloaded gdk-pixbuf-sys v0.22.0
Downloaded muldiv v1.0.1
Downloaded zerofrom v0.1.6
Downloaded g2poly v1.2.2
Downloaded gvdb-macros v0.1.16
Downloaded ghash v0.5.1
Downloaded idna_adapter v1.2.1
Downloaded zerofrom-derive v0.1.6
Downloaded pin-project-internal v1.1.11
Downloaded gobject-sys v0.22.0
Downloaded graphene-rs v0.22.0
Downloaded gdk-pixbuf v0.22.0
Downloaded gstreamer-base-sys v0.25.0
Downloaded iana-time-zone v0.1.65
Downloaded spake2 v0.4.0
Downloaded icu_provider v2.1.1
Downloaded rand_chacha v0.9.0
Downloaded memmap2 v0.9.10
Downloaded x11-dl v2.21.0
Downloaded icu_normalizer_data v2.1.1
Downloaded glib-sys v0.22.3
Downloaded httparse v1.10.1
Downloaded memchr v2.8.0
Downloaded pretty_env_logger v0.5.0
Downloaded zerocopy-derive v0.8.47
Downloaded hashbrown v0.16.1
Downloaded idna v1.1.0
Downloaded itertools v0.14.0
Downloaded same-file v1.0.6
Downloaded zbus v5.14.0
Downloaded zxcvbn v3.1.0
Downloaded moxcms v0.8.1
Downloaded hkdf v0.12.4
Downloaded gio v0.22.2
Downloaded gimli v0.32.3
Downloaded image v0.25.10
Downloaded strum v0.28.0
Downloaded icu_collections v2.1.1
Downloaded writeable v0.6.2
Downloaded noise-protocol v0.2.1
Downloaded winnow v1.0.0
Downloaded gstreamer-base v0.25.0
Downloaded time-core v0.1.8
Downloaded gstreamer-sys v0.25.0
Downloaded walkdir v2.5.0
Downloaded gettext-rs v0.7.7
Downloaded xattr v1.6.1
Downloaded zeroize v1.8.2
Downloaded indexmap v2.13.0
Downloaded gdk4-x11-sys v0.11.0
Downloaded parking v2.2.1
Downloaded salsa20 v0.10.2
Downloaded lru v0.16.3
Downloaded num-conv v0.2.1
Downloaded zbus_macros v5.14.0
Downloaded graphene-sys v0.22.0
Downloaded sha1 v0.10.6
Downloaded glib-macros v0.22.2
Downloaded x25519-dalek v2.0.1
Downloaded icu_properties_data v2.1.2
Downloaded humantime v2.3.0
Downloaded stable_deref_trait v1.2.1
Downloaded litrs v1.0.0
Downloaded kstring v2.0.2
Downloaded sha-1 v0.10.1
Downloaded trackable v1.3.0
Downloaded glib v0.22.3
Downloaded gsk4 v0.11.1
Downloaded serde_spanned v1.1.0
Downloaded is-terminal v0.4.17
Downloaded lazy_static v1.5.0
Downloaded percent-encoding v2.3.2
Downloaded num-rational v0.4.2
Downloaded universal-hash v0.5.1
Downloaded version-compare v0.2.1
Downloaded version_check v0.9.5
Downloaded pango v0.22.0
Downloaded zbus_names v4.3.1
Downloaded gsk4-sys v0.11.1
Downloaded gtk4-macros v0.11.0
Downloaded yoke-derive v0.8.1
Downloaded gstreamer-video-sys v0.25.0
Downloaded litemap v0.8.1
Downloaded unicode-xid v0.2.6
Downloaded num-integer v0.1.46
Downloaded zmij v1.0.21
Downloaded getrandom v0.3.4
Downloaded zvariant v5.10.0
Downloaded md5 v0.7.0
Downloaded hmac v0.12.1
Downloaded http v1.4.0
Downloaded winnow v0.7.15
Downloaded libadwaita v0.9.1
Downloaded serde_repr v0.1.20
Downloaded gstreamer v0.25.1
Downloaded rustc_version v0.4.1
Downloaded quote v1.0.45
Downloaded temp-dir v0.1.16
Downloaded shlex v1.3.0
Downloaded static_assertions v1.1.0
Downloaded synstructure v0.13.2
Downloaded termcolor v1.4.1
Downloaded libc v0.2.183
Downloaded time-macros v0.2.27
Downloaded strum_macros v0.28.0
Downloaded hex v0.4.3
Downloaded inout v0.1.4
Downloaded generic-array v0.14.7
Downloaded zvariant_utils v3.3.0
Downloaded signal-hook-registry v1.4.8
Downloaded rustc-demangle v0.1.27
Downloaded tinystr v0.8.2
Downloaded rand_core v0.9.5
Downloaded ppv-lite86 v0.2.21
Downloaded semver v1.0.27
Downloaded rand_core v0.6.4
Downloaded linux-raw-sys v0.12.1
Downloaded utf8_iter v1.0.4
Downloaded slab v0.4.12
Downloaded target-lexicon v0.13.3
Downloaded toml_writer v1.1.0+spec-1.1.0
Downloaded simd-adler32 v0.3.9
Downloaded thiserror v2.0.18
Downloaded system-deps v7.0.7
Downloaded toml_datetime v1.1.0+spec-1.1.0
Downloaded sha2 v0.10.9
Downloaded toml_datetime v0.7.5+spec-1.1.0
Downloaded rmp-serde v1.3.1
Downloaded thiserror-impl v2.0.18
Downloaded pin-project v1.1.11
Downloaded stun_codec v0.4.0
Downloaded polling v3.11.0
Downloaded uuid v1.23.0
Downloaded zvariant_derive v5.10.0
Downloaded zerovec-derive v0.11.2
Downloaded ashpd v0.13.9
Downloaded gettext-sys v0.26.0
Downloaded rmp v0.8.15
Downloaded rqrr v0.10.1
Downloaded async-tungstenite v0.34.0
Downloaded gdk4-x11 v0.11.0
Downloaded smallvec v1.15.1
Downloaded tracing-attributes v0.1.31
Downloaded toml_parser v1.1.0+spec-1.1.0
Downloaded serde_core v1.0.228
Downloaded toml v0.9.12+spec-1.1.0
Downloaded tracing-core v0.1.36
Downloaded getrandom v0.2.17
Downloaded gtk4-sys v0.11.1
Downloaded libadwaita-sys v0.9.1
Downloaded proc-macro2 v1.0.106
Downloaded gvdb v0.10.0
Downloaded tempfile v3.27.0
Downloaded serde_derive v1.0.228
Downloaded unicode-ident v1.0.24
Downloaded gdk4 v0.11.1
Downloaded gstreamer-audio v0.25.0
Downloaded socket2 v0.6.3
Downloaded url v2.5.8
Downloaded gdk4-sys v0.11.1
Downloaded gdk4-wayland v0.11.0
Downloaded tar v0.4.45
Downloaded toml_edit v0.25.8+spec-1.1.0
Downloaded qrcode v0.14.1
Downloaded serde v1.0.228
Downloaded icu_locale_core v2.1.1
Downloaded icu_normalizer v2.1.1
Downloaded rand v0.8.5
Downloaded typenum v1.19.0
Downloaded gtk4 v0.11.1
Downloaded tungstenite v0.29.0
Downloaded gstreamer-audio-sys v0.25.0
Downloaded gstreamer-video v0.25.0
Downloaded rand v0.9.2
Downloaded unicode-segmentation v1.13.2
Downloaded futures-util v0.3.32
Downloaded regex v1.12.3
Downloaded serde_json v1.0.149
Downloaded quick-xml v0.38.4
Downloaded quick-xml v0.39.2
Downloaded syn v1.0.109
Downloaded time v0.3.47
Downloaded smol v2.0.2
Downloaded syn v2.0.117
Downloaded zerocopy v0.8.47
Downloaded regex-syntax v0.8.10
Downloaded rustix v1.1.4
Downloaded tracing v0.1.44
Downloaded regex-automata v0.4.14
Downloaded pxfm v0.1.28
Downloaded gstreamer-pbutils-sys v0.25.0
Downloaded gstreamer-pbutils v0.25.0
Downloaded magic-wormhole v0.8.0
Compiling proc-macro2 v1.0.106
Compiling quote v1.0.45
Compiling unicode-ident v1.0.24
Compiling libc v0.2.183
Compiling winnow v1.0.0
Compiling winnow v0.7.15
Compiling heck v0.5.0
Compiling target-lexicon v0.13.3
Compiling pkg-config v0.3.32
Compiling toml_datetime v0.7.5+spec-1.1.0
Compiling serde_spanned v1.1.0
Compiling smallvec v1.15.1
Compiling version-compare v0.2.1
Compiling cfg-if v1.0.4
Compiling cfg-expr v0.20.7
Compiling pin-project-lite v0.2.17
Compiling futures-core v0.3.32
Compiling memchr v2.8.0
Compiling futures-io v0.3.32
Compiling autocfg v1.5.0
Compiling syn v2.0.117
Compiling toml_parser v1.1.0+spec-1.1.0
Compiling bitflags v2.11.0
Compiling version_check v0.9.5
Compiling typenum v1.19.0
Compiling slab v0.4.12
Compiling generic-array v0.14.7
Compiling futures-sink v0.3.32
Compiling futures-channel v0.3.32
Compiling futures-task v0.3.32
Compiling subtle v2.6.1
Compiling parking v2.2.1
Compiling crossbeam-utils v0.8.21
Compiling getrandom v0.2.17
Compiling num-traits v0.2.19
Compiling hashbrown v0.16.1
Compiling serde_core v1.0.228
Compiling rand_core v0.6.4
Compiling toml v0.9.12+spec-1.1.0
Compiling equivalent v1.0.2
Compiling concurrent-queue v2.5.0
Compiling fastrand v2.3.0
Compiling toml_datetime v1.1.0+spec-1.1.0
Compiling system-deps v7.0.7
Compiling serde v1.0.228
Compiling indexmap v2.13.0
Compiling errno v0.3.14
Compiling rustix v1.1.4
Compiling semver v1.0.27
Compiling toml_edit v0.25.8+spec-1.1.0
Compiling rustc_version v0.4.1
Compiling futures-lite v2.6.1
Compiling stable_deref_trait v1.2.1
Compiling glib-sys v0.22.3
Compiling gobject-sys v0.22.0
Compiling gio-sys v0.22.0
Compiling gdk-pixbuf-sys v0.22.0
Compiling cairo-sys-rs v0.22.0
Compiling synstructure v0.13.2
Compiling pango-sys v0.22.0
Compiling proc-macro-crate v3.5.0
Compiling gdk4-sys v0.11.1
Compiling linux-raw-sys v0.12.1
Compiling event-listener v5.4.1
Compiling gstreamer-sys v0.25.0
Compiling thiserror v2.0.18
Compiling event-listener-strategy v0.5.4
Compiling graphene-sys v0.22.0
Compiling zerocopy v0.8.47
Compiling gstreamer-base-sys v0.25.0
Compiling async-io v2.6.0
Compiling async-task v4.7.1
Compiling crc32fast v1.5.0
Compiling either v1.15.0
Compiling zmij v1.0.21
Compiling async-channel v2.5.0
Compiling gsk4-sys v0.11.1
Compiling aho-corasick v1.1.4
Compiling log v0.4.29
Compiling regex-syntax v0.8.10
Compiling atomic-waker v1.1.2
Compiling piper v0.2.5
Compiling zeroize_derive v1.4.3
Compiling futures-macro v0.3.32
Compiling serde_derive v1.0.228
Compiling glib-macros v0.22.2
Compiling zerofrom-derive v0.1.6
Compiling zeroize v1.8.2
Compiling yoke-derive v0.8.1
Compiling futures-util v0.3.32
Compiling crypto-common v0.1.7
Compiling block-buffer v0.10.4
Compiling zerocopy-derive v0.8.47
Compiling zerofrom v0.1.6
Compiling digest v0.10.7
Compiling zerovec-derive v0.11.2
Compiling yoke v0.8.1
error[E0659]: `STATX_TYPE` is ambiguous
--> /home/buildozer/aports/community/warp/src/warp-v1.0.0/output/cargo-home/registry/src/index.crates.io-1949cf8c6b5b557f/rustix-1.1.4/src/fs/statx.rs:75:25
|
75 | const TYPE = c::STATX_TYPE;
| ^^^^^^^^^^ ambiguous name
|
= note: ambiguous because of multiple glob imports of a name in the same module
note: `STATX_TYPE` could refer to the constant imported here
--> /home/buildozer/aports/community/warp/src/warp-v1.0.0/output/cargo-home/registry/src/index.crates.io-1949cf8c6b5b557f/rustix-1.1.4/src/backend/libc/c.rs:7:16
|
7 | pub(crate) use libc::*;
| ^^^^^^^
= help: consider adding an explicit import of `STATX_TYPE` to disambiguate
note: `STATX_TYPE` could also refer to the constant imported here
--> /home/buildozer/aports/community/warp/src/warp-v1.0.0/output/cargo-home/registry/src/index.crates.io-1949cf8c6b5b557f/rustix-1.1.4/src/backend/libc/c.rs:512:16
|
512 | pub(crate) use statx_flags::*;
| ^^^^^^^^^^^^^^
= help: consider adding an explicit import of `STATX_TYPE` to disambiguate
error[E0659]: `STATX_MODE` is ambiguous
--> /home/buildozer/aports/community/warp/src/warp-v1.0.0/output/cargo-home/registry/src/index.crates.io-1949cf8c6b5b557f/rustix-1.1.4/src/fs/statx.rs:78:25
|
78 | const MODE = c::STATX_MODE;
| ^^^^^^^^^^ ambiguous name
|
= note: ambiguous because of multiple glob imports of a name in the same module
note: `STATX_MODE` could refer to the constant imported here
--> /home/buildozer/aports/community/warp/src/warp-v1.0.0/output/cargo-home/registry/src/index.crates.io-1949cf8c6b5b557f/rustix-1.1.4/src/backend/libc/c.rs:7:16
|
7 | pub(crate) use libc::*;
| ^^^^^^^
= help: consider adding an explicit import of `STATX_MODE` to disambiguate
note: `STATX_MODE` could also refer to the constant imported here
--> /home/buildozer/aports/community/warp/src/warp-v1.0.0/output/cargo-home/registry/src/index.crates.io-1949cf8c6b5b557f/rustix-1.1.4/src/backend/libc/c.rs:512:16
|
512 | pub(crate) use statx_flags::*;
| ^^^^^^^^^^^^^^
= help: consider adding an explicit import of `STATX_MODE` to disambiguate
error[E0659]: `STATX_NLINK` is ambiguous
--> /home/buildozer/aports/community/warp/src/warp-v1.0.0/output/cargo-home/registry/src/index.crates.io-1949cf8c6b5b557f/rustix-1.1.4/src/fs/statx.rs:81:26
|
81 | const NLINK = c::STATX_NLINK;
| ^^^^^^^^^^^ ambiguous name
|
= note: ambiguous because of multiple glob imports of a name in the same module
note: `STATX_NLINK` could refer to the constant imported here
--> /home/buildozer/aports/community/warp/src/warp-v1.0.0/output/cargo-home/registry/src/index.crates.io-1949cf8c6b5b557f/rustix-1.1.4/src/backend/libc/c.rs:7:16
|
7 | pub(crate) use libc::*;
| ^^^^^^^
= help: consider adding an explicit import of `STATX_NLINK` to disambiguate
note: `STATX_NLINK` could also refer to the constant imported here
--> /home/buildozer/aports/community/warp/src/warp-v1.0.0/output/cargo-home/registry/src/index.crates.io-1949cf8c6b5b557f/rustix-1.1.4/src/backend/libc/c.rs:512:16
|
512 | pub(crate) use statx_flags::*;
| ^^^^^^^^^^^^^^
= help: consider adding an explicit import of `STATX_NLINK` to disambiguate
error[E0659]: `STATX_UID` is ambiguous
--> /home/buildozer/aports/community/warp/src/warp-v1.0.0/output/cargo-home/registry/src/index.crates.io-1949cf8c6b5b557f/rustix-1.1.4/src/fs/statx.rs:84:24
|
84 | const UID = c::STATX_UID;
| ^^^^^^^^^ ambiguous name
|
= note: ambiguous because of multiple glob imports of a name in the same module
note: `STATX_UID` could refer to the constant imported here
--> /home/buildozer/aports/community/warp/src/warp-v1.0.0/output/cargo-home/registry/src/index.crates.io-1949cf8c6b5b557f/rustix-1.1.4/src/backend/libc/c.rs:7:16
|
7 | pub(crate) use libc::*;
| ^^^^^^^
= help: consider adding an explicit import of `STATX_UID` to disambiguate
note: `STATX_UID` could also refer to the constant imported here
--> /home/buildozer/aports/community/warp/src/warp-v1.0.0/output/cargo-home/registry/src/index.crates.io-1949cf8c6b5b557f/rustix-1.1.4/src/backend/libc/c.rs:512:16
|
512 | pub(crate) use statx_flags::*;
| ^^^^^^^^^^^^^^
= help: consider adding an explicit import of `STATX_UID` to disambiguate
error[E0659]: `STATX_GID` is ambiguous
--> /home/buildozer/aports/community/warp/src/warp-v1.0.0/output/cargo-home/registry/src/index.crates.io-1949cf8c6b5b557f/rustix-1.1.4/src/fs/statx.rs:87:24
|
87 | const GID = c::STATX_GID;
| ^^^^^^^^^ ambiguous name
|
= note: ambiguous because of multiple glob imports of a name in the same module
note: `STATX_GID` could refer to the constant imported here
--> /home/buildozer/aports/community/warp/src/warp-v1.0.0/output/cargo-home/registry/src/index.crates.io-1949cf8c6b5b557f/rustix-1.1.4/src/backend/libc/c.rs:7:16
|
7 | pub(crate) use libc::*;
| ^^^^^^^
= help: consider adding an explicit import of `STATX_GID` to disambiguate
note: `STATX_GID` could also refer to the constant imported here
--> /home/buildozer/aports/community/warp/src/warp-v1.0.0/output/cargo-home/registry/src/index.crates.io-1949cf8c6b5b557f/rustix-1.1.4/src/backend/libc/c.rs:512:16
|
512 | pub(crate) use statx_flags::*;
| ^^^^^^^^^^^^^^
= help: consider adding an explicit import of `STATX_GID` to disambiguate
error[E0659]: `STATX_ATIME` is ambiguous
--> /home/buildozer/aports/community/warp/src/warp-v1.0.0/output/cargo-home/registry/src/index.crates.io-1949cf8c6b5b557f/rustix-1.1.4/src/fs/statx.rs:90:26
|
90 | const ATIME = c::STATX_ATIME;
| ^^^^^^^^^^^ ambiguous name
|
= note: ambiguous because of multiple glob imports of a name in the same module
note: `STATX_ATIME` could refer to the constant imported here
--> /home/buildozer/aports/community/warp/src/warp-v1.0.0/output/cargo-home/registry/src/index.crates.io-1949cf8c6b5b557f/rustix-1.1.4/src/backend/libc/c.rs:7:16
|
7 | pub(crate) use libc::*;
| ^^^^^^^
= help: consider adding an explicit import of `STATX_ATIME` to disambiguate
note: `STATX_ATIME` could also refer to the constant imported here
--> /home/buildozer/aports/community/warp/src/warp-v1.0.0/output/cargo-home/registry/src/index.crates.io-1949cf8c6b5b557f/rustix-1.1.4/src/backend/libc/c.rs:512:16
|
512 | pub(crate) use statx_flags::*;
| ^^^^^^^^^^^^^^
= help: consider adding an explicit import of `STATX_ATIME` to disambiguate
error[E0659]: `STATX_MTIME` is ambiguous
--> /home/buildozer/aports/community/warp/src/warp-v1.0.0/output/cargo-home/registry/src/index.crates.io-1949cf8c6b5b557f/rustix-1.1.4/src/fs/statx.rs:93:26
|
93 | const MTIME = c::STATX_MTIME;
| ^^^^^^^^^^^ ambiguous name
|
= note: ambiguous because of multiple glob imports of a name in the same module
note: `STATX_MTIME` could refer to the constant imported here
--> /home/buildozer/aports/community/warp/src/warp-v1.0.0/output/cargo-home/registry/src/index.crates.io-1949cf8c6b5b557f/rustix-1.1.4/src/backend/libc/c.rs:7:16
|
7 | pub(crate) use libc::*;
| ^^^^^^^
= help: consider adding an explicit import of `STATX_MTIME` to disambiguate
note: `STATX_MTIME` could also refer to the constant imported here
--> /home/buildozer/aports/community/warp/src/warp-v1.0.0/output/cargo-home/registry/src/index.crates.io-1949cf8c6b5b557f/rustix-1.1.4/src/backend/libc/c.rs:512:16
|
512 | pub(crate) use statx_flags::*;
| ^^^^^^^^^^^^^^
= help: consider adding an explicit import of `STATX_MTIME` to disambiguate
error[E0659]: `STATX_CTIME` is ambiguous
--> /home/buildozer/aports/community/warp/src/warp-v1.0.0/output/cargo-home/registry/src/index.crates.io-1949cf8c6b5b557f/rustix-1.1.4/src/fs/statx.rs:96:26
|
96 | const CTIME = c::STATX_CTIME;
| ^^^^^^^^^^^ ambiguous name
|
= note: ambiguous because of multiple glob imports of a name in the same module
note: `STATX_CTIME` could refer to the constant imported here
--> /home/buildozer/aports/community/warp/src/warp-v1.0.0/output/cargo-home/registry/src/index.crates.io-1949cf8c6b5b557f/rustix-1.1.4/src/backend/libc/c.rs:7:16
|
7 | pub(crate) use libc::*;
| ^^^^^^^
= help: consider adding an explicit import of `STATX_CTIME` to disambiguate
note: `STATX_CTIME` could also refer to the constant imported here
--> /home/buildozer/aports/community/warp/src/warp-v1.0.0/output/cargo-home/registry/src/index.crates.io-1949cf8c6b5b557f/rustix-1.1.4/src/backend/libc/c.rs:512:16
|
512 | pub(crate) use statx_flags::*;
| ^^^^^^^^^^^^^^
= help: consider adding an explicit import of `STATX_CTIME` to disambiguate
error[E0659]: `STATX_INO` is ambiguous
--> /home/buildozer/aports/community/warp/src/warp-v1.0.0/output/cargo-home/registry/src/index.crates.io-1949cf8c6b5b557f/rustix-1.1.4/src/fs/statx.rs:99:24
|
99 | const INO = c::STATX_INO;
| ^^^^^^^^^ ambiguous name
|
= note: ambiguous because of multiple glob imports of a name in the same module
note: `STATX_INO` could refer to the constant imported here
--> /home/buildozer/aports/community/warp/src/warp-v1.0.0/output/cargo-home/registry/src/index.crates.io-1949cf8c6b5b557f/rustix-1.1.4/src/backend/libc/c.rs:7:16
|
7 | pub(crate) use libc::*;
| ^^^^^^^
= help: consider adding an explicit import of `STATX_INO` to disambiguate
note: `STATX_INO` could also refer to the constant imported here
--> /home/buildozer/aports/community/warp/src/warp-v1.0.0/output/cargo-home/registry/src/index.crates.io-1949cf8c6b5b557f/rustix-1.1.4/src/backend/libc/c.rs:512:16
|
512 | pub(crate) use statx_flags::*;
| ^^^^^^^^^^^^^^
= help: consider adding an explicit import of `STATX_INO` to disambiguate
error[E0659]: `STATX_SIZE` is ambiguous
--> /home/buildozer/aports/community/warp/src/warp-v1.0.0/output/cargo-home/registry/src/index.crates.io-1949cf8c6b5b557f/rustix-1.1.4/src/fs/statx.rs:102:25
|
102 | const SIZE = c::STATX_SIZE;
| ^^^^^^^^^^ ambiguous name
|
= note: ambiguous because of multiple glob imports of a name in the same module
note: `STATX_SIZE` could refer to the constant imported here
--> /home/buildozer/aports/community/warp/src/warp-v1.0.0/output/cargo-home/registry/src/index.crates.io-1949cf8c6b5b557f/rustix-1.1.4/src/backend/libc/c.rs:7:16
|
7 | pub(crate) use libc::*;
| ^^^^^^^
= help: consider adding an explicit import of `STATX_SIZE` to disambiguate
note: `STATX_SIZE` could also refer to the constant imported here
--> /home/buildozer/aports/community/warp/src/warp-v1.0.0/output/cargo-home/registry/src/index.crates.io-1949cf8c6b5b557f/rustix-1.1.4/src/backend/libc/c.rs:512:16
|
512 | pub(crate) use statx_flags::*;
| ^^^^^^^^^^^^^^
= help: consider adding an explicit import of `STATX_SIZE` to disambiguate
error[E0659]: `STATX_BLOCKS` is ambiguous
--> /home/buildozer/aports/community/warp/src/warp-v1.0.0/output/cargo-home/registry/src/index.crates.io-1949cf8c6b5b557f/rustix-1.1.4/src/fs/statx.rs:105:27
|
105 | const BLOCKS = c::STATX_BLOCKS;
| ^^^^^^^^^^^^ ambiguous name
|
= note: ambiguous because of multiple glob imports of a name in the same module
note: `STATX_BLOCKS` could refer to the constant imported here
--> /home/buildozer/aports/community/warp/src/warp-v1.0.0/output/cargo-home/registry/src/index.crates.io-1949cf8c6b5b557f/rustix-1.1.4/src/backend/libc/c.rs:7:16
|
7 | pub(crate) use libc::*;
| ^^^^^^^
= help: consider adding an explicit import of `STATX_BLOCKS` to disambiguate
note: `STATX_BLOCKS` could also refer to the constant imported here
--> /home/buildozer/aports/community/warp/src/warp-v1.0.0/output/cargo-home/registry/src/index.crates.io-1949cf8c6b5b557f/rustix-1.1.4/src/backend/libc/c.rs:512:16
|
512 | pub(crate) use statx_flags::*;
| ^^^^^^^^^^^^^^
= help: consider adding an explicit import of `STATX_BLOCKS` to disambiguate
error[E0659]: `STATX_BASIC_STATS` is ambiguous
--> /home/buildozer/aports/community/warp/src/warp-v1.0.0/output/cargo-home/registry/src/index.crates.io-1949cf8c6b5b557f/rustix-1.1.4/src/fs/statx.rs:108:32
|
108 | const BASIC_STATS = c::STATX_BASIC_STATS;
| ^^^^^^^^^^^^^^^^^ ambiguous name
|
= note: ambiguous because of multiple glob imports of a name in the same module
note: `STATX_BASIC_STATS` could refer to the constant imported here
--> /home/buildozer/aports/community/warp/src/warp-v1.0.0/output/cargo-home/registry/src/index.crates.io-1949cf8c6b5b557f/rustix-1.1.4/src/backend/libc/c.rs:7:16
|
7 | pub(crate) use libc::*;
| ^^^^^^^
= help: consider adding an explicit import of `STATX_BASIC_STATS` to disambiguate
note: `STATX_BASIC_STATS` could also refer to the constant imported here
--> /home/buildozer/aports/community/warp/src/warp-v1.0.0/output/cargo-home/registry/src/index.crates.io-1949cf8c6b5b557f/rustix-1.1.4/src/backend/libc/c.rs:512:16
|
512 | pub(crate) use statx_flags::*;
| ^^^^^^^^^^^^^^
= help: consider adding an explicit import of `STATX_BASIC_STATS` to disambiguate
error[E0659]: `STATX_BTIME` is ambiguous
--> /home/buildozer/aports/community/warp/src/warp-v1.0.0/output/cargo-home/registry/src/index.crates.io-1949cf8c6b5b557f/rustix-1.1.4/src/fs/statx.rs:111:26
|
111 | const BTIME = c::STATX_BTIME;
| ^^^^^^^^^^^ ambiguous name
|
= note: ambiguous because of multiple glob imports of a name in the same module
note: `STATX_BTIME` could refer to the constant imported here
--> /home/buildozer/aports/community/warp/src/warp-v1.0.0/output/cargo-home/registry/src/index.crates.io-1949cf8c6b5b557f/rustix-1.1.4/src/backend/libc/c.rs:7:16
|
7 | pub(crate) use libc::*;
| ^^^^^^^
= help: consider adding an explicit import of `STATX_BTIME` to disambiguate
note: `STATX_BTIME` could also refer to the constant imported here
--> /home/buildozer/aports/community/warp/src/warp-v1.0.0/output/cargo-home/registry/src/index.crates.io-1949cf8c6b5b557f/rustix-1.1.4/src/backend/libc/c.rs:512:16
|
512 | pub(crate) use statx_flags::*;
| ^^^^^^^^^^^^^^
= help: consider adding an explicit import of `STATX_BTIME` to disambiguate
error[E0659]: `STATX_MNT_ID` is ambiguous
--> /home/buildozer/aports/community/warp/src/warp-v1.0.0/output/cargo-home/registry/src/index.crates.io-1949cf8c6b5b557f/rustix-1.1.4/src/fs/statx.rs:114:27
|
114 | const MNT_ID = c::STATX_MNT_ID;
| ^^^^^^^^^^^^ ambiguous name
|
= note: ambiguous because of multiple glob imports of a name in the same module
note: `STATX_MNT_ID` could refer to the constant imported here
--> /home/buildozer/aports/community/warp/src/warp-v1.0.0/output/cargo-home/registry/src/index.crates.io-1949cf8c6b5b557f/rustix-1.1.4/src/backend/libc/c.rs:7:16
|
7 | pub(crate) use libc::*;
| ^^^^^^^
= help: consider adding an explicit import of `STATX_MNT_ID` to disambiguate
note: `STATX_MNT_ID` could also refer to the constant imported here
--> /home/buildozer/aports/community/warp/src/warp-v1.0.0/output/cargo-home/registry/src/index.crates.io-1949cf8c6b5b557f/rustix-1.1.4/src/backend/libc/c.rs:512:16
|
512 | pub(crate) use statx_flags::*;
| ^^^^^^^^^^^^^^
= help: consider adding an explicit import of `STATX_MNT_ID` to disambiguate
error[E0659]: `STATX_DIOALIGN` is ambiguous
--> /home/buildozer/aports/community/warp/src/warp-v1.0.0/output/cargo-home/registry/src/index.crates.io-1949cf8c6b5b557f/rustix-1.1.4/src/fs/statx.rs:117:29
|
117 | const DIOALIGN = c::STATX_DIOALIGN;
| ^^^^^^^^^^^^^^ ambiguous name
|
= note: ambiguous because of multiple glob imports of a name in the same module
note: `STATX_DIOALIGN` could refer to the constant imported here
--> /home/buildozer/aports/community/warp/src/warp-v1.0.0/output/cargo-home/registry/src/index.crates.io-1949cf8c6b5b557f/rustix-1.1.4/src/backend/libc/c.rs:7:16
|
7 | pub(crate) use libc::*;
| ^^^^^^^
= help: consider adding an explicit import of `STATX_DIOALIGN` to disambiguate
note: `STATX_DIOALIGN` could also refer to the constant imported here
--> /home/buildozer/aports/community/warp/src/warp-v1.0.0/output/cargo-home/registry/src/index.crates.io-1949cf8c6b5b557f/rustix-1.1.4/src/backend/libc/c.rs:512:16
|
512 | pub(crate) use statx_flags::*;
| ^^^^^^^^^^^^^^
= help: consider adding an explicit import of `STATX_DIOALIGN` to disambiguate
error[E0659]: `STATX_ALL` is ambiguous
--> /home/buildozer/aports/community/warp/src/warp-v1.0.0/output/cargo-home/registry/src/index.crates.io-1949cf8c6b5b557f/rustix-1.1.4/src/fs/statx.rs:120:24
|
120 | const ALL = c::STATX_ALL;
| ^^^^^^^^^ ambiguous name
|
= note: ambiguous because of multiple glob imports of a name in the same module
note: `STATX_ALL` could refer to the constant imported here
--> /home/buildozer/aports/community/warp/src/warp-v1.0.0/output/cargo-home/registry/src/index.crates.io-1949cf8c6b5b557f/rustix-1.1.4/src/backend/libc/c.rs:7:16
|
7 | pub(crate) use libc::*;
| ^^^^^^^
= help: consider adding an explicit import of `STATX_ALL` to disambiguate
note: `STATX_ALL` could also refer to the constant imported here
--> /home/buildozer/aports/community/warp/src/warp-v1.0.0/output/cargo-home/registry/src/index.crates.io-1949cf8c6b5b557f/rustix-1.1.4/src/backend/libc/c.rs:512:16
|
512 | pub(crate) use statx_flags::*;
| ^^^^^^^^^^^^^^
= help: consider adding an explicit import of `STATX_ALL` to disambiguate
error[E0659]: `STATX_ATTR_COMPRESSED` is ambiguous
--> /home/buildozer/aports/community/warp/src/warp-v1.0.0/output/cargo-home/registry/src/index.crates.io-1949cf8c6b5b557f/rustix-1.1.4/src/fs/statx.rs:133:31
|
133 | const COMPRESSED = c::STATX_ATTR_COMPRESSED as u64;
| ^^^^^^^^^^^^^^^^^^^^^ ambiguous name
|
= note: ambiguous because of multiple glob imports of a name in the same module
note: `STATX_ATTR_COMPRESSED` could refer to the constant imported here
--> /home/buildozer/aports/community/warp/src/warp-v1.0.0/output/cargo-home/registry/src/index.crates.io-1949cf8c6b5b557f/rustix-1.1.4/src/backend/libc/c.rs:7:16
|
7 | pub(crate) use libc::*;
| ^^^^^^^
= help: consider adding an explicit import of `STATX_ATTR_COMPRESSED` to disambiguate
note: `STATX_ATTR_COMPRESSED` could also refer to the constant imported here
--> /home/buildozer/aports/community/warp/src/warp-v1.0.0/output/cargo-home/registry/src/index.crates.io-1949cf8c6b5b557f/rustix-1.1.4/src/backend/libc/c.rs:512:16
|
512 | pub(crate) use statx_flags::*;
| ^^^^^^^^^^^^^^
= help: consider adding an explicit import of `STATX_ATTR_COMPRESSED` to disambiguate
error[E0659]: `STATX_ATTR_IMMUTABLE` is ambiguous
--> /home/buildozer/aports/community/warp/src/warp-v1.0.0/output/cargo-home/registry/src/index.crates.io-1949cf8c6b5b557f/rustix-1.1.4/src/fs/statx.rs:136:30
|
136 | const IMMUTABLE = c::STATX_ATTR_IMMUTABLE as u64;
| ^^^^^^^^^^^^^^^^^^^^ ambiguous name
|
= note: ambiguous because of multiple glob imports of a name in the same module
note: `STATX_ATTR_IMMUTABLE` could refer to the constant imported here
--> /home/buildozer/aports/community/warp/src/warp-v1.0.0/output/cargo-home/registry/src/index.crates.io-1949cf8c6b5b557f/rustix-1.1.4/src/backend/libc/c.rs:7:16
|
7 | pub(crate) use libc::*;
| ^^^^^^^
= help: consider adding an explicit import of `STATX_ATTR_IMMUTABLE` to disambiguate
note: `STATX_ATTR_IMMUTABLE` could also refer to the constant imported here
--> /home/buildozer/aports/community/warp/src/warp-v1.0.0/output/cargo-home/registry/src/index.crates.io-1949cf8c6b5b557f/rustix-1.1.4/src/backend/libc/c.rs:512:16
|
512 | pub(crate) use statx_flags::*;
| ^^^^^^^^^^^^^^
= help: consider adding an explicit import of `STATX_ATTR_IMMUTABLE` to disambiguate
error[E0659]: `STATX_ATTR_APPEND` is ambiguous
--> /home/buildozer/aports/community/warp/src/warp-v1.0.0/output/cargo-home/registry/src/index.crates.io-1949cf8c6b5b557f/rustix-1.1.4/src/fs/statx.rs:139:27
|
139 | const APPEND = c::STATX_ATTR_APPEND as u64;
| ^^^^^^^^^^^^^^^^^ ambiguous name
|
= note: ambiguous because of multiple glob imports of a name in the same module
note: `STATX_ATTR_APPEND` could refer to the constant imported here
--> /home/buildozer/aports/community/warp/src/warp-v1.0.0/output/cargo-home/registry/src/index.crates.io-1949cf8c6b5b557f/rustix-1.1.4/src/backend/libc/c.rs:7:16
|
7 | pub(crate) use libc::*;
| ^^^^^^^
= help: consider adding an explicit import of `STATX_ATTR_APPEND` to disambiguate
note: `STATX_ATTR_APPEND` could also refer to the constant imported here
--> /home/buildozer/aports/community/warp/src/warp-v1.0.0/output/cargo-home/registry/src/index.crates.io-1949cf8c6b5b557f/rustix-1.1.4/src/backend/libc/c.rs:512:16
|
512 | pub(crate) use statx_flags::*;
| ^^^^^^^^^^^^^^
= help: consider adding an explicit import of `STATX_ATTR_APPEND` to disambiguate
error[E0659]: `STATX_ATTR_NODUMP` is ambiguous
--> /home/buildozer/aports/community/warp/src/warp-v1.0.0/output/cargo-home/registry/src/index.crates.io-1949cf8c6b5b557f/rustix-1.1.4/src/fs/statx.rs:142:27
|
142 | const NODUMP = c::STATX_ATTR_NODUMP as u64;
| ^^^^^^^^^^^^^^^^^ ambiguous name
|
= note: ambiguous because of multiple glob imports of a name in the same module
note: `STATX_ATTR_NODUMP` could refer to the constant imported here
--> /home/buildozer/aports/community/warp/src/warp-v1.0.0/output/cargo-home/registry/src/index.crates.io-1949cf8c6b5b557f/rustix-1.1.4/src/backend/libc/c.rs:7:16
|
7 | pub(crate) use libc::*;
| ^^^^^^^
= help: consider adding an explicit import of `STATX_ATTR_NODUMP` to disambiguate
note: `STATX_ATTR_NODUMP` could also refer to the constant imported here
--> /home/buildozer/aports/community/warp/src/warp-v1.0.0/output/cargo-home/registry/src/index.crates.io-1949cf8c6b5b557f/rustix-1.1.4/src/backend/libc/c.rs:512:16
|
512 | pub(crate) use statx_flags::*;
| ^^^^^^^^^^^^^^
= help: consider adding an explicit import of `STATX_ATTR_NODUMP` to disambiguate
error[E0659]: `STATX_ATTR_ENCRYPTED` is ambiguous
--> /home/buildozer/aports/community/warp/src/warp-v1.0.0/output/cargo-home/registry/src/index.crates.io-1949cf8c6b5b557f/rustix-1.1.4/src/fs/statx.rs:145:30
|
145 | const ENCRYPTED = c::STATX_ATTR_ENCRYPTED as u64;
| ^^^^^^^^^^^^^^^^^^^^ ambiguous name
|
= note: ambiguous because of multiple glob imports of a name in the same module
note: `STATX_ATTR_ENCRYPTED` could refer to the constant imported here
--> /home/buildozer/aports/community/warp/src/warp-v1.0.0/output/cargo-home/registry/src/index.crates.io-1949cf8c6b5b557f/rustix-1.1.4/src/backend/libc/c.rs:7:16
|
7 | pub(crate) use libc::*;
| ^^^^^^^
= help: consider adding an explicit import of `STATX_ATTR_ENCRYPTED` to disambiguate
note: `STATX_ATTR_ENCRYPTED` could also refer to the constant imported here
--> /home/buildozer/aports/community/warp/src/warp-v1.0.0/output/cargo-home/registry/src/index.crates.io-1949cf8c6b5b557f/rustix-1.1.4/src/backend/libc/c.rs:512:16
|
512 | pub(crate) use statx_flags::*;
| ^^^^^^^^^^^^^^
= help: consider adding an explicit import of `STATX_ATTR_ENCRYPTED` to disambiguate
error[E0659]: `STATX_ATTR_AUTOMOUNT` is ambiguous
--> /home/buildozer/aports/community/warp/src/warp-v1.0.0/output/cargo-home/registry/src/index.crates.io-1949cf8c6b5b557f/rustix-1.1.4/src/fs/statx.rs:148:30
|
148 | const AUTOMOUNT = c::STATX_ATTR_AUTOMOUNT as u64;
| ^^^^^^^^^^^^^^^^^^^^ ambiguous name
|
= note: ambiguous because of multiple glob imports of a name in the same module
note: `STATX_ATTR_AUTOMOUNT` could refer to the constant imported here
--> /home/buildozer/aports/community/warp/src/warp-v1.0.0/output/cargo-home/registry/src/index.crates.io-1949cf8c6b5b557f/rustix-1.1.4/src/backend/libc/c.rs:7:16
|
7 | pub(crate) use libc::*;
| ^^^^^^^
= help: consider adding an explicit import of `STATX_ATTR_AUTOMOUNT` to disambiguate
note: `STATX_ATTR_AUTOMOUNT` could also refer to the constant imported here
--> /home/buildozer/aports/community/warp/src/warp-v1.0.0/output/cargo-home/registry/src/index.crates.io-1949cf8c6b5b557f/rustix-1.1.4/src/backend/libc/c.rs:512:16
|
512 | pub(crate) use statx_flags::*;
| ^^^^^^^^^^^^^^
= help: consider adding an explicit import of `STATX_ATTR_AUTOMOUNT` to disambiguate
error[E0659]: `STATX_ATTR_MOUNT_ROOT` is ambiguous
--> /home/buildozer/aports/community/warp/src/warp-v1.0.0/output/cargo-home/registry/src/index.crates.io-1949cf8c6b5b557f/rustix-1.1.4/src/fs/statx.rs:151:31
|
151 | const MOUNT_ROOT = c::STATX_ATTR_MOUNT_ROOT as u64;
| ^^^^^^^^^^^^^^^^^^^^^ ambiguous name
|
= note: ambiguous because of multiple glob imports of a name in the same module
note: `STATX_ATTR_MOUNT_ROOT` could refer to the constant imported here
--> /home/buildozer/aports/community/warp/src/warp-v1.0.0/output/cargo-home/registry/src/index.crates.io-1949cf8c6b5b557f/rustix-1.1.4/src/backend/libc/c.rs:7:16
|
7 | pub(crate) use libc::*;
| ^^^^^^^
= help: consider adding an explicit import of `STATX_ATTR_MOUNT_ROOT` to disambiguate
note: `STATX_ATTR_MOUNT_ROOT` could also refer to the constant imported here
--> /home/buildozer/aports/community/warp/src/warp-v1.0.0/output/cargo-home/registry/src/index.crates.io-1949cf8c6b5b557f/rustix-1.1.4/src/backend/libc/c.rs:512:16
|
512 | pub(crate) use statx_flags::*;
| ^^^^^^^^^^^^^^
= help: consider adding an explicit import of `STATX_ATTR_MOUNT_ROOT` to disambiguate
error[E0659]: `STATX_ATTR_VERITY` is ambiguous
--> /home/buildozer/aports/community/warp/src/warp-v1.0.0/output/cargo-home/registry/src/index.crates.io-1949cf8c6b5b557f/rustix-1.1.4/src/fs/statx.rs:154:27
|
154 | const VERITY = c::STATX_ATTR_VERITY as u64;
| ^^^^^^^^^^^^^^^^^ ambiguous name
|
= note: ambiguous because of multiple glob imports of a name in the same module
note: `STATX_ATTR_VERITY` could refer to the constant imported here
--> /home/buildozer/aports/community/warp/src/warp-v1.0.0/output/cargo-home/registry/src/index.crates.io-1949cf8c6b5b557f/rustix-1.1.4/src/backend/libc/c.rs:7:16
|
7 | pub(crate) use libc::*;
| ^^^^^^^
= help: consider adding an explicit import of `STATX_ATTR_VERITY` to disambiguate
note: `STATX_ATTR_VERITY` could also refer to the constant imported here
--> /home/buildozer/aports/community/warp/src/warp-v1.0.0/output/cargo-home/registry/src/index.crates.io-1949cf8c6b5b557f/rustix-1.1.4/src/backend/libc/c.rs:512:16
|
512 | pub(crate) use statx_flags::*;
| ^^^^^^^^^^^^^^
= help: consider adding an explicit import of `STATX_ATTR_VERITY` to disambiguate
error[E0659]: `STATX_ATTR_DAX` is ambiguous
--> /home/buildozer/aports/community/warp/src/warp-v1.0.0/output/cargo-home/registry/src/index.crates.io-1949cf8c6b5b557f/rustix-1.1.4/src/fs/statx.rs:157:24
|
157 | const DAX = c::STATX_ATTR_DAX as u64;
| ^^^^^^^^^^^^^^ ambiguous name
|
= note: ambiguous because of multiple glob imports of a name in the same module
note: `STATX_ATTR_DAX` could refer to the constant imported here
--> /home/buildozer/aports/community/warp/src/warp-v1.0.0/output/cargo-home/registry/src/index.crates.io-1949cf8c6b5b557f/rustix-1.1.4/src/backend/libc/c.rs:7:16
|
7 | pub(crate) use libc::*;
| ^^^^^^^
= help: consider adding an explicit import of `STATX_ATTR_DAX` to disambiguate
note: `STATX_ATTR_DAX` could also refer to the constant imported here
--> /home/buildozer/aports/community/warp/src/warp-v1.0.0/output/cargo-home/registry/src/index.crates.io-1949cf8c6b5b557f/rustix-1.1.4/src/backend/libc/c.rs:512:16
|
512 | pub(crate) use statx_flags::*;
| ^^^^^^^^^^^^^^
= help: consider adding an explicit import of `STATX_ATTR_DAX` to disambiguate
Compiling enumflags2_derive v0.7.12
Compiling displaydoc v0.2.5
Compiling zerovec v0.11.5
Compiling futures-executor v0.3.32
Compiling thiserror-impl v2.0.18
Compiling inout v0.1.4
Compiling universal-hash v0.5.1
Compiling cipher v0.4.4
Compiling glib v0.22.3
Compiling regex-automata v0.4.14
Compiling tinystr v0.8.2
Compiling gtk4-sys v0.11.1
Compiling serde_json v1.0.149
Compiling strsim v0.11.1
Compiling ident_case v1.0.1
Compiling zvariant_utils v3.3.0
Compiling opaque-debug v0.3.1
Compiling getrandom v0.3.4
For more information about this error, try `rustc --explain E0659`.
Compiling litemap v0.8.1
error: could not compile `rustix` (lib) due to 25 previous errors
warning: build failed, waiting for other jobs to finish...
ninja: job failed with status 101: /usr/bin/env CARGO_HOME=/home/buildozer/aports/community/warp/src/warp-v1.0.0/output/cargo-home LOCALEDIR=/usr/share/locale /usr/bin/cargo build --manifest-path /home/buildozer/aports/community/warp/src/warp-v1.0.0/Cargo.toml --target-dir /home/buildozer/aports/community/warp/src/warp-v1.0.0/output/src --no-default-features --release --features meson,qr_code_scanning && cp src/release/warp src/warp
ninja: subcommand failed
INFO: autodetecting backend as ninja
INFO: calculating backend command to run: /usr/bin/ninja -C /home/buildozer/aports/community/warp/src/warp-v1.0.0/output
>>> ERROR: warp: build failed
>>> warp: Uninstalling dependencies...
( 1/284) Purging .makedepends-warp (20261015.001708)
( 2/284) Purging cargo (1.99.0-r2)
( 3/284) Purging rust (1.99.0-r2)
( 4/284) Purging desktop-file-utils (0.28-r0)
( 5/284) Purging gst-plugins-bad-dev (1.28.7-r0)
( 6/284) Purging itstool (2.0.7-r3)
( 7/284) Purging py3-libxml2-pyc (2.13.9-r2)
( 8/284) Purging py3-libxml2 (2.13.9-r2)
( 9/284) Purging libadwaita-dev (1.10.0-r0)
( 10/284) Purging libadwaita (1.10.0-r0)
( 11/284) Purging adwaita-fonts (51.0-r0)
( 12/284) Purging adwaita-fonts-sans (51.0-r0)
( 13/284) Purging adwaita-fonts-mono (51.0-r0)
( 14/284) Purging abuild-meson (1.12.1-r0)
( 15/284) Purging meson-pyc (1.12.1-r0)
( 16/284) Purging meson (1.12.1-r0)
( 17/284) Purging samurai (1.3-r0)
( 18/284) Purging at-spi2-core (2.62.0-r0)
( 19/284) Purging glycin-image-rs (2.2.1-r0)
( 20/284) Purging glycin-svg (2.2.1-r0)
( 21/284) Purging gst-plugins-base-dev (1.28.7-r0)
( 22/284) Purging gstreamer-dev (1.28.7-r0)
( 23/284) Purging gstreamer-ptp-helper (1.28.7-r0)
( 24/284) Purging gtk4.0-dev (4.24.1-r0)
( 25/284) Purging at-spi2-core-dev (2.62.0-r0)
( 26/284) Purging libepoxy-dev (1.5.10-r1)
( 27/284) Purging libxinerama-dev (1.1.6-r0)
( 28/284) Purging libxkbcommon-dev (1.13.2-r0)
( 29/284) Purging wayland-protocols (1.49-r0)
( 30/284) Purging libssh2 (1.11.1-r3)
( 31/284) Purging libva-dev (2.24.1-r0)
( 32/284) Purging libxml2-dev (2.13.9-r2)
( 33/284) Purging libxtst-dev (1.2.5-r0)
( 34/284) Purging libxtst (1.2.5-r0)
( 35/284) Purging mesa-dev (26.2.4-r1)
( 36/284) Purging libxdamage-dev (1.1.7-r0)
( 37/284) Purging libxshmfence-dev (1.3.3-r0)
( 38/284) Purging orc-dev (0.4.42-r1)
( 39/284) Purging orc-compiler (0.4.42-r1)
( 40/284) Purging pango-dev (1.58.2-r0)
( 41/284) Purging pango-tools (1.58.2-r0)
( 42/284) Purging py3-packaging-pyc (26.2-r0)
( 43/284) Purging py3-parsing-pyc (3.3.3-r0)
( 44/284) Purging python3-pyc (3.14.8-r0)
( 45/284) Purging python3-pycache-pyc0 (3.14.8-r0)
( 46/284) Purging xcb-proto-pyc (1.17.0-r1)
( 47/284) Purging pyc (3.14.8-r0)
( 48/284) Purging scudo-malloc (23.1.3-r0)
( 49/284) Purging vulkan-loader-dev (1.4.360-r0)
( 50/284) Purging vulkan-headers (1.4.360-r0)
( 51/284) Purging wayland-dev (1.26.0-r0)
( 52/284) Purging wayland-libs-server (1.26.0-r0)
( 53/284) Purging xz-dev (5.8.4-r0)
( 54/284) Purging gtk4.0 (4.24.1-r0)
( 55/284) Purging gtk-update-icon-cache (3.24.52-r0)
( 56/284) Purging hicolor-icon-theme (0.18-r0)
( 57/284) Purging iso-codes (4.20.1-r0)
( 58/284) Purging tzdata (2026e-r0)
( 59/284) Purging gst-plugins-bad (1.28.7-r0)
( 60/284) Purging gst-plugins-base (1.28.7-r0)
( 61/284) Purging flite (2.2-r7)
( 62/284) Purging libsndfile (1.2.2-r3)
( 63/284) Purging openal-soft-libs (1.25.2-r1)
( 64/284) Purging sndio-libs (1.10.0-r7)
( 65/284) Purging alsa-lib (1.2.16.1-r0)
( 66/284) Purging aom-libs (3.15.2-r0)
( 67/284) Purging gtk+3.0 (3.24.52-r0)
Executing gtk+3.0-3.24.52-r0.post-deinstall
( 68/284) Purging gobject-introspection (1.86.0-r2)
( 69/284) Purging libatk-bridge-2.0 (2.62.0-r0)
( 70/284) Purging at-spi2-core-libs (2.62.0-r0)
( 71/284) Purging cups-libs (2.4.20-r0)
( 72/284) Purging avahi-libs (0.9_rc5-r0)
( 73/284) Purging harfbuzz-dev (14.2.1-r0)
( 74/284) Purging harfbuzz-cairo (14.2.1-r0)
( 75/284) Purging harfbuzz-gobject (14.2.1-r0)
( 76/284) Purging harfbuzz-icu (14.2.1-r0)
( 77/284) Purging harfbuzz-subset (14.2.1-r0)
( 78/284) Purging graphite2-dev (1.3.15-r0)
( 79/284) Purging cairo-dev (1.18.4-r1)
( 80/284) Purging cairo-tools (1.18.4-r1)
( 81/284) Purging cairo-gobject (1.18.4-r1)
( 82/284) Purging libxft-dev (2.3.9-r0)
( 83/284) Purging gdk-pixbuf-dev (2.44.8-r0)
( 84/284) Purging libglycin-dev (2.2.1-r0)
( 85/284) Purging fontconfig-dev (2.18.1-r0)
( 86/284) Purging freetype-dev (2.14.3-r0)
( 87/284) Purging brotli-dev (1.2.0-r1)
( 88/284) Purging brotli (1.2.0-r1)
( 89/284) Purging graphene-dev (1.10.8-r5)
( 90/284) Purging graphene (1.10.8-r5)
( 91/284) Purging glib-dev (2.90.0-r0)
( 92/284) Purging bzip2-dev (1.0.8-r6)
( 93/284) Purging docbook-xsl (1.79.2-r13)
( 94/284) Purging docbook-xsl-ns (1.79.2-r13)
Executing docbook-xsl-ns-1.79.2-r13.pre-deinstall
( 95/284) Purging docbook-xsl-nons (1.79.2-r13)
Executing docbook-xsl-nons-1.79.2-r13.pre-deinstall
( 96/284) Purging docbook-xml (4.5-r10)
Executing docbook-xml-4.5-r10.pre-deinstall
( 97/284) Purging gettext-dev (1.0-r0)
( 98/284) Purging xz (5.8.4-r0)
( 99/284) Purging gettext-asprintf (1.0-r0)
(100/284) Purging gettext (1.0-r0)
(101/284) Purging gettext-envsubst (1.0-r0)
(102/284) Purging libxml2-utils (2.13.9-r2)
(103/284) Purging libxslt (1.1.43-r3)
(104/284) Purging py3-packaging (26.2-r0)
(105/284) Purging py3-parsing (3.3.3-r0)
(106/284) Purging pcre2-dev (10.49-r0)
(107/284) Purging libpcre2-16 (10.49-r0)
(108/284) Purging libpcre2-32 (10.49-r0)
(109/284) Purging libedit-dev (20260512.3.1-r0)
(110/284) Purging ncurses-dev (6.6_p20260822-r0)
(111/284) Purging libncurses++ (6.6_p20260822-r0)
(112/284) Purging bsd-compat-headers (0.7.2-r6)
(113/284) Purging librsvg (2.62.3-r0)
(114/284) Purging gdk-pixbuf (2.44.8-r0)
Executing gdk-pixbuf-2.44.8-r0.pre-deinstall
(115/284) Purging shared-mime-info (2.4-r7)
Executing shared-mime-info-2.4-r7.post-deinstall
(116/284) Purging libglycin (2.2.1-r0)
(117/284) Purging bubblewrap (0.13.1-r0)
(118/284) Purging neon (0.36.0-r0)
(119/284) Purging ca-certificates (20260909-r0)
Executing ca-certificates-20260909-r0.post-deinstall
(120/284) Purging pango (1.58.2-r0)
(121/284) Purging cairo (1.18.4-r1)
(122/284) Purging cdparanoia-libs (10.2-r14)
(123/284) Purging dbus-dev (1.16.2-r4)
(124/284) Purging libzbar (0.23.93-r2)
(125/284) Purging dbus-libs (1.16.2-r4)
(126/284) Purging directfb (1.7.7-r8)
(127/284) Purging libgudev (238-r1)
(128/284) Purging eudev-libs (3.2.14-r8)
(129/284) Purging expat-dev (2.9.0-r0)
(130/284) Purging expat (2.9.0-r0)
(131/284) Purging faac (1.31.1-r0)
(132/284) Purging faad2-libs (2.11.2-r0)
(133/284) Purging fdk-aac (2.0.2-r4)
(134/284) Purging libxft (2.3.9-r0)
(135/284) Purging libass (0.17.5-r0)
(136/284) Purging fontconfig (2.18.1-r0)
(137/284) Purging harfbuzz (14.2.1-r0)
(138/284) Purging freetype (2.14.3-r0)
(139/284) Purging fribidi-dev (1.0.16-r3)
(140/284) Purging fribidi (1.0.16-r3)
(141/284) Purging gettext-libs (1.0-r0)
(142/284) Purging gstreamer (1.28.7-r0)
(143/284) Purging libatk-1.0 (2.62.0-r0)
(144/284) Purging glib (2.90.0-r0)
(145/284) Purging librtmp (2.4_git20190330-r5)
(146/284) Purging gnutls (3.8.13-r0)
(147/284) Purging graphite2 (1.3.15-r0)
(148/284) Purging gsm (1.0.24-r0)
(149/284) Purging libdrm-dev (2.4.134-r0)
(150/284) Purging libpciaccess-dev (0.19-r0)
(151/284) Purging mesa-gl (26.2.4-r1)
(152/284) Purging libva (2.24.1-r0)
(153/284) Purging mesa-egl (26.2.4-r1)
(154/284) Purging mesa-gles (26.2.4-r1)
(155/284) Purging mesa-gbm (26.2.4-r1)
(156/284) Purging mesa (26.2.4-r1)
(157/284) Purging libdrm (2.4.134-r0)
(158/284) Purging libpciaccess (0.19-r0)
(159/284) Purging hwdata-pci (0.412-r0)
(160/284) Purging icu-dev (78.1-r0)
(161/284) Purging icu (78.1-r0)
(162/284) Purging icu-libs (78.1-r0)
(163/284) Purging icu-data-en (78.1-r0)
(164/284) Purging openexr-libopenexr (3.4.15-r0)
(165/284) Purging imath (3.2.2-r1)
(166/284) Purging lame-libs (3.100-r5)
(167/284) Purging lcms2 (2.19.1-r0)
(168/284) Purging util-linux-dev (2.42.4-r3)
(169/284) Purging libfdisk (2.42.4-r3)
(170/284) Purging liblastlog2 (2.42.4-r3)
(171/284) Purging libmount (2.42.4-r3)
(172/284) Purging libsmartcols (2.42.4-r3)
(173/284) Purging libuuid (2.42.4-r3)
(174/284) Purging libblkid (2.42.4-r3)
(175/284) Purging libxxf86vm-dev (1.1.7-r0)
(176/284) Purging libxxf86vm (1.1.7-r0)
(177/284) Purging libxrender-dev (0.9.12-r0)
(178/284) Purging libxi-dev (1.8.3-r0)
(179/284) Purging libxi (1.8.3-r0)
(180/284) Purging libxfixes-dev (6.0.2-r0)
(181/284) Purging libxext-dev (1.3.7-r0)
(182/284) Purging libx11-dev (1.8.13-r0)
(183/284) Purging xtrans (1.6.0-r0)
(184/284) Purging libxcb-dev (1.17.0-r2)
(185/284) Purging xcb-proto (1.17.0-r1)
(186/284) Purging python3 (3.14.8-r0)
(187/284) Purging libxdmcp-dev (1.1.5-r1)
(188/284) Purging libxkbcommon-x11 (1.13.2-r0)
(189/284) Purging libxv (1.0.13-r0)
(190/284) Purging libxrandr (1.5.5-r0)
(191/284) Purging libxinerama (1.1.6-r0)
(192/284) Purging libxext (1.3.7-r0)
(193/284) Purging libxcursor (1.2.3-r0)
(194/284) Purging libxdamage (1.1.7-r0)
(195/284) Purging libxrender (0.9.12-r0)
(196/284) Purging libxcomposite (0.4.7-r0)
(197/284) Purging libxfixes (6.0.2-r0)
(198/284) Purging libx11 (1.8.13-r0)
(199/284) Purging libxcb (1.17.0-r2)
(200/284) Purging libxdmcp (1.1.5-r1)
(201/284) Purging libbsd (0.12.2-r0)
(202/284) Purging libbz2 (1.0.8-r6)
(203/284) Purging libdav1d (1.5.4-r0)
(204/284) Purging libdc1394 (2.2.7-r0)
(205/284) Purging libde265 (1.1.2-r0)
(206/284) Purging openexr-libopenexrcore (3.4.15-r0)
(207/284) Purging libdeflate (1.26-r0)
(208/284) Purging libdvdnav (6.1.1-r1)
(209/284) Purging libdvdread (6.1.3-r2)
(210/284) Purging libdvdcss (1.4.3-r0)
(211/284) Purging libeconf (0.8.4-r0)
(212/284) Purging libelf (0.195-r0)
(213/284) Purging libepoxy (1.5.10-r1)
(214/284) Purging libffi-dev (3.8.0-r0)
(215/284) Purging llvm23-libs (23.1.3-r0)
(216/284) Purging wayland-libs-cursor (1.26.0-r0)
(217/284) Purging wayland-libs-client (1.26.0-r0)
(218/284) Purging p11-kit (0.26.2-r1)
(219/284) Purging libffi (3.8.0-r0)
(220/284) Purging libflac (1.5.0-r0)
(221/284) Purging libformw (6.6_p20260822-r0)
(222/284) Purging libfreeaptx (0.2.2-r0)
(223/284) Purging libintl (1.0-r0)
(224/284) Purging spandsp (0.0.6-r5)
(225/284) Purging tiff (4.7.2-r0)
(226/284) Purging libjpeg-turbo (3.1.3-r0)
(227/284) Purging libmd (1.3.0-r0)
(228/284) Purging libmenuw (6.6_p20260822-r0)
(229/284) Purging libmodplug (0.8.9.0-r3)
(230/284) Purging libvorbis (1.3.7-r2)
(231/284) Purging libtheora (1.2.0-r1)
(232/284) Purging libogg (1.3.6-r0)
(233/284) Purging libpanelw (6.6_p20260822-r0)
(234/284) Purging libpng-dev (1.6.59-r0)
(235/284) Purging libpng (1.6.59-r0)
(236/284) Purging libraw1394 (2.1.2-r5)
(237/284) Purging libseccomp-dev (2.6.1-r0)
(238/284) Purging linux-headers (7.2.1-r0)
(239/284) Purging libseccomp (2.6.1-r0)
(240/284) Purging libwebpmux (1.6.0-r0)
(241/284) Purging libwebp (1.6.0-r0)
(242/284) Purging libsharpyuv (1.6.0-r0)
(243/284) Purging libsrt (1.5.5-r0)
(244/284) Purging libsrtp (2.8.0-r0)
(245/284) Purging libSvtAv1Enc (4.2.0-r0)
(246/284) Purging libtasn1 (4.21.0-r0)
(247/284) Purging libunibreak (6.1-r0)
(248/284) Purging libusb (1.0.30-r0)
(249/284) Purging libxau-dev (1.0.12-r0)
(250/284) Purging libxau (1.0.12-r0)
(251/284) Purging libxkbcommon (1.13.2-r0)
(252/284) Purging xkeyboard-config (2.48-r0)
(253/284) Purging libxml2 (2.13.9-r2)
(254/284) Purging libxshmfence (1.3.3-r0)
(255/284) Purging linux-pam (1.7.1-r4)
(256/284) Purging mpdecimal (4.0.1-r0)
(257/284) Purging mpg123-libs (1.33.7-r0)
(258/284) Purging nettle (3.10.2-r0)
(259/284) Purging x265-libs (4.2-r0)
(260/284) Purging numactl (2.0.19-r0)
(261/284) Purging openexr-libilmthread (3.4.15-r0)
(262/284) Purging openexr-libiex (3.4.15-r0)
(263/284) Purging openh264 (2.6.0-r0)
(264/284) Purging openjpeg (2.5.4-r2)
(265/284) Purging opus (1.6.1-r0)
(266/284) Purging orc (0.4.42-r1)
(267/284) Purging pixman-dev (0.46.4-r0)
(268/284) Purging pixman (0.46.4-r0)
(269/284) Purging sqlite-dev (3.54.0-r0)
(270/284) Purging sqlite-libs (3.54.0-r0)
(271/284) Purging sqlite (3.54.0-r0)
(272/284) Purging readline (8.3.3-r1)
(273/284) Purging sbc (2.1-r0)
(274/284) Purging utmps-libs (0.1.3.4-r0)
(275/284) Purging skalibs-libs (2.15.1.0-r0)
(276/284) Purging soundtouch (2.4.1-r0)
(277/284) Purging tslib (1.24-r0)
(278/284) Purging vo-aacenc (0.1.3-r3)
(279/284) Purging vo-amrwbenc (0.1.3-r3)
(280/284) Purging vulkan-loader (1.4.360-r0)
(281/284) Purging wayland-libs-egl (1.26.0-r0)
(282/284) Purging xorgproto (2025.1-r0)
(283/284) Purging xz-libs (5.8.4-r0)
(284/284) Purging zlib-dev (1.3.2-r1)
Executing busybox-1.38.0-r7.trigger
OK: 238.9 MiB in 100 packages